Registration of Investment Security Transfer Denied
type: Class
alternative label: 拒绝注册投资证券转让
subclass of: RBKpy2Nyht27CqaMOeeTx1N
definition: The concept of "Registration of Investment Security Transfer Denied" refers to the legal denial of the registration of a transfer of investment securities, which includes banking, commercial paper, and creditor claims.