Ambulance Negligence
type: Class
alternative label: 救护车疏忽
subclass of: R7Zbqfhemxs6PR7r2Fk6NeY
definition: Ambulance Negligence refers to a legal claim for damages resulting from the failure of ambulance personnel to provide appropriate medical care or transport in emergency situations.