Location
type: Class
preferred label: Global
alternative label: स्थान
subclass of: Thing
definition: The name of a position on the Earth, usually in the context of continents, countries, and their political subdivisions (e.g., regions, states or provinces, cities, towns, villages).