Motion to Transfer Venue
type: Class
preferred label: Motion for Change of Venue
alternative label: 转移管辖权动议
subclass of: R9Ii4OzSADsjS0VegX12oQJ
subclass of: RC339aKhjRAuw4JtEQUn5xw
definition: A Motion to Transfer Venue is a formal request made to a court to change the location of a legal proceeding to a different jurisdiction or court for reasons such as convenience or fairness.