U.S. House of Representatives
type: Class
alternative label: House of Congress
alternative label: Lower House
subclass of: R1Sko1SJ18Z0VAHyctFNGw
definition: The U.S. House of Representatives is the lower chamber of Congress, responsible for initiating revenue-related legislation and representing the population of the states based on proportional representation. The House exercises legislative power, oversight, and the authority to impeach federal officials.