Investment Asset Attributes
type: Class
subclass of: R70jMZb6xYrVCXW6f3EbO1e
definition: Investment Asset Attributes refer to the specific characteristics and features that define an investment asset. These attributes include aspects such as voting rights, redemption rights, transfer rights, income rate, form, instrument dependency, distribution methods, repayment methods, underlying assets, and guarantees.