Arapaho
type: Class
alternative label: 阿拉帕霍族
subclass of: RC1ceWXE3emNHpYlrOvvmxG
subclass of: RDOvAHsvY8TKJ1O1orXPM9o
definition: Arapaho (Language) refers to the written or spoken structured system of communication used by the Arapaho people, which consists of its own unique grammar and vocabulary.