Skolt Sami
type: Class
alternative label: 斯科尔特萨米语
subclass of: RDOvAHsvY8TKJ1O1orXPM9o
definition: Skolt Sami is a written or spoken structured system of communication used by the Skolt Sami people, which belongs to the Language top-level class.