California Superior Court - Ventura Cty.
type: Class
subclass of: RsTnyZoBckeYgjbwks7DL8
definition: California Superior Court - Ventura Cty. is a specific court located in Ventura County, California that has jurisdiction over civil and criminal cases within its geographic area.