Motion to Reinstate Retiree Benefits
type: Class
alternative label: 恢复退休福利动议
subclass of: R9Ii4OzSADsjS0VegX12oQJ
definition: A Motion to Reinstate Retiree Benefits is a legal request made in a bankruptcy case to restore previously terminated benefits for retired individuals.