White
type: Class
preferred label: Caucasian
alternative label: 白色
subclass of: RC50Vs3pkDyvqMHRukXE98O
definition: White (Ethnicity and Race) refers to a social construct that categorizes individuals based on their physical characteristics and cultural heritage, specifically those who identify as having European ancestry and are perceived as having light skin color.