Trade Libel
type: Class
alternative label: 商业诽谤
subclass of: R9JBjakDIsSF91IjI8v4skI
definition: Trade Libel, also known as Injurious Falsehood, is a type of defamation that involves making false statements about a business or its products or services, which results in financial harm to the business.