JJ60 Permission applications (UK J-CODE)
type: Class
subclass of: RwD7QSyU5m2So0AXqivp9q
definition: All permission applications where permission to proceed is required, such as in judicial review proceedings or on appeal.