Witness Fees Expense
type: Class
alternative label: 证人费用支出
subclass of: R8KRPJpptKbBzyQalWni4Zv
definition: A witness fees expense is a type of expense that refers to the compensation paid to a person who provides testimony in a legal proceeding, which may include fees for travel, lodging, and other related expenses.