Missouri Circuit Court - Sullivan County
type: Class
subclass of: RDECjssxw76vdlahxiUTb4L
definition: Missouri Circuit Court - Sullivan County: A court of law in Missouri that has jurisdiction over legal cases within Sullivan County.