Washington Pollution Control Hearings Board
type: Class
subclass of: R7A8d432BB51903431e1Cafa
definition: The Washington Pollution Control Hearings Board is a specialized court within the Washington State Courts system that hears cases related to environmental pollution and enforces regulations to protect the environment.