Partnership Claim
type: Class
alternative label: 合伙索赔
subclass of: R9JkfZIjkVSa5ud1tJ14w3i
definition: A Partnership Claim is a legal action brought by one or more partners against the partnership or other partners for breach of partnership agreement or other wrongdoing.