Patent Infringement - Design Patents
type: Class
alternative label: 专利侵权 - 设计专利
subclass of: R9G5Ptc8g9T3Ag0GDVQOwae
definition: The unauthorized use or imitation of a unique ornamental design protected by a patent.