Motion to Remove Professional
type: Class
alternative label: 撤销专业人员动议
subclass of: R9Ii4OzSADsjS0VegX12oQJ
definition: A Motion to Remove Professional is a request made in a bankruptcy case to remove a professional, such as an attorney or accountant, from their role in the case.