Tennessee Supreme Court - Special Workers' Compensation Appeals Panel
type: Class
subclass of: RF09acf3C7946344a6751294
definition: The Tennessee Supreme Court - Special Workers' Compensation Appeals Panel is a specialized division of the Tennessee Supreme Court that handles appeals related to workers' compensation cases.