Suicide and "Right to Die" Claims
type: Class
alternative label: 自杀和“死亡权”要求
subclass of: RBzrK4RsgfLScZvC4Z4lCCX
subclass of: RCfunX4u69LUQ3gbhckE0oI
definition: The concept of "Suicide and 'Right to Die' Claims" refers to legal claims and arguments related to intentional self-harm or assisted suicide, including cases involving prisoners and allegations of negligence.