Milestone Objectives
type: Class
alternative label: 里程碑目标
subclass of: R8IPYrNykDTHjhTEpNetWUR
definition: Milestone Objectives are specific goals or targets that must be achieved within a project, serving as markers of progress towards the overall project management objectives.