Buyer Consent Not Unreasonably Conditioned
type: Class
alternative label: 买方同意不得不合理限制
subclass of: R7J7NYI0WlIIflyMEgnXHIq
definition: Buyer Consent Not Unreasonably Conditioned: A legal concept that requires a buyer's consent to be freely given without any unreasonable conditions imposed by the seller.