Tutoring
type: Class
alternative label: 辅导
subclass of: R7p8xRy14cVNnXyHxD92nQk
definition: Tutoring refers to the provision of educational assistance or instruction by a tutor to a student, as a condition of a criminal disposition imposed on the student's parents.