Workers' Compensation Court
type: Class
subclass of: R85BLSakJPEy7c7KvxZyOe
definition: A Workers' Compensation Court is a specific type of administrative proceeding forum that handles disputes related to workers' compensation claims.