Rent Coverage Ratio Clause
type: Class
alternative label: 租金覆盖率条款
subclass of: RDe0RKU39BlhcyACJW30ZLc
definition: A Rent Coverage Ratio Clause is a provision in a contract that requires a tenant to maintain a certain level of income in order to ensure they can afford to pay rent.