Polish
type: Class
alternative label: 波兰语
subclass of: RDOvAHsvY8TKJ1O1orXPM9o
definition: Polish (Language) is a structured system of communication consisting of grammar and vocabulary used in Poland and by Polish speakers worldwide.