Voluntary Dismissal
type: Class
alternative label: 自愿撤诉
subclass of: RCKTvbBtse7f4CWyAp1iNdO
definition: A voluntary dismissal is a legal action taken by a plaintiff to end a case without prejudice, meaning they can refile the case at a later time.