Bills of Costs
type: Class
alternative label: 费用清单
subclass of: RCzVJL7xHCPdcNwnHbt71AD
definition: A bill of costs is a detailed statement of expenses incurred during a legal case, including court fees, witness fees, and other costs, which is submitted to the court for reimbursement.