Motion to Continue Hearing
type: Class
alternative label: 延期听证动议
subclass of: RbAyL0ru5m8CyqAShGVq0e
subclass of: Rv1W9XAEwmBhuHZ7qNHqew
definition: A Motion to Continue Hearing is a formal request made to a court to postpone a scheduled hearing or trial to a later date.