Texas District Court - Grayson County
type: Class
subclass of: RDvQuaxSojEqV7COK0FlBTI
definition: A Texas District Court located in Grayson County, which is a trial court of general jurisdiction in Texas, handling civil and criminal cases within its geographical jurisdiction.