720 Labor/Management Relations (Union) (PACER NoS)
type: Class
subclass of: RDrbY6MeW8iV9jZP5QxI6Vg
definition: Action relating to disputes between labor unions and employers as well as all petitions regarding actions of the Nation Labor Relations Board (NLRB)