Federal Trade Commission Act Claim
type: Class
alternative label: 联邦贸易委员会法索赔
subclass of: R7MsH9WtTPf14W1GB1m8zrB
subclass of: R9LVBKjvGRuzwgtlhuLST36
definition: A Federal Trade Commission Act Claim is a legal claim that alleges a violation of the laws and regulations enforced by the Federal Trade Commission, which is responsible for protecting consumers from unfair or deceptive business practices.