Pornography and Obscene Material
type: Class
alternative label: 色情和淫秽材料
subclass of: R7fCP2EQY8XQ5fxqiYaKPQA
definition: The violation of laws or ordinances prohibiting the manufacture, publishing, sale, purchase, or possession of sexually explicit material, e.g., literature, photographs, etc.