Kumyk
type: Class
alternative label: 库木克语
subclass of: RDOvAHsvY8TKJ1O1orXPM9o
definition: Kumyk is a language that belongs to the Turkic language family and is spoken primarily in the Dagestan Republic of Russia.