Washington Superior Court - King County District Court
type: Class
subclass of: RChEjOHUONk1Yp2qm3OHJdc
definition: A court located in King County, Washington that has jurisdiction over certain types of cases within its district.