Thai
type: Class
alternative label: 泰国的
subclass of: RDOvAHsvY8TKJ1O1orXPM9o
definition: Thai (Language) is a structured system of communication consisting of grammar and vocabulary used in Thailand and by Thai speakers worldwide.