Release from Active Duty
type: Class
alternative label: 解除现役
subclass of: RXSQ7cfAYqk20qAg9n2wxi
definition: The concept of "Release from Active Duty" refers to the legal objective of obtaining a discharge from military service, and the associated legal and professional frameworks that support this goal within the context of bankruptcy and restructuring.