Indemnification Clause
type: Class
alternative label: 赔偿条款
subclass of: RDe0RKU39BlhcyACJW30ZLc
definition: An Indemnification Clause is a provision in a contract that requires one party to compensate the other for any losses or damages incurred as a result of the contract or a related transaction.