Term of Agreement Clause
type: Class
alternative label: 协议条款条款
subclass of: RDe0RKU39BlhcyACJW30ZLc
definition: A Term of Agreement Clause is a provision in a contract that specifies the duration of the agreement and the conditions under which it can be terminated.