Insurance Claims
type: Class
alternative label: 保险理赔
subclass of: R8jYAnNATrfoBxAtIKpf72X
definition: Insurance Claims: A legal demand made by an insured party to an insurance company for compensation or coverage for a loss or damage that is covered by the insurance policy.