Par
type: Class
preferred label: Par Value
alternative label: Face Value
alternative label: Nominal Value
subclass of: R9UcujGuJ216ZiqT4I2aRge
definition: Par refers to the face value of a financial instrument, such as a bond or loan, at the time of issuance or redemption. It is the nominal value that does not account for interest rates or market fluctuations