Gifts Inter Vivos
type: Class
alternative label: 生前赠与
subclass of: R3SDQBy4KfjSgp3bgpb4Fx
definition: Gifts Inter Vivos: A legal term referring to gifts made during the lifetime of the donor, which are irrevocable and are not subject to probate upon the donor's death, and are often used as a means of reducing estate taxes.