Retail Real Estate Asset
type: Class
alternative label: 零售房地产资产
subclass of: RUhSbbDJZa8Crs3tIWcIfV
hidden label: RETAIL
definition: Real estate retail properties including malls, stores, and restaurants.