Rule of Construction Clause
type: Class
alternative label: 解释条款
subclass of: RDe0RKU39BlhcyACJW30ZLc
definition: A Rule of Construction Clause is a provision in a contract that helps interpret the meaning of other clauses within the same contract.