Possessing Stolen Property
type: Class
alternative label: 持有赃物
subclass of: R7yKB3SkQ5bQZsUOV5R0jT1
definition: The concept of Possessing Stolen Property refers to the criminal offense of knowingly having control over property that has been unlawfully taken from another person, without the owner's consent.