Transportation Law
type: Class
alternative label: 运输法
subclass of: RSYBzf149Mi5KE0YtmpUmr
hidden label: TRAN
definition: Law involving transportation infrastructure and all forms of road, railway, water and air transport.