Disgust
type: Class
alternative label: Abhorrence
alternative label: Aversion
alternative label: Contempt
alternative label: Loathing
alternative label: Repugnance
subclass of: R66kux3H2uERxPz0E7KxtN
definition: Disgust is a strong emotion of revulsion or profound disapproval aroused by something unpleasant or offensive.