Debtor's Rebuttal of Presumption of Abuse
type: Class
alternative label: ऋणादाता के द्वारा अपशब्द के प्रतिवाद का खंडन
subclass of: R8zijLH2GH0SxOhIdzeDOs3
definition: A Debtor's Rebuttal of Presumption of Abuse is a legal document filed in bankruptcy cases that challenges the presumption that the debtor's income is too high to qualify for Chapter 7 bankruptcy.