Claim for Falling on Spill
type: Class
alternative label: 因溢水摔倒索赔
subclass of: R6BgoOCiXfPfFeBgDhUcP3
definition: A claim for falling on spill is a legal action brought by a plaintiff who has suffered injuries as a result of slipping and falling on a spill, and is based on the legal theory of negligence.